Error:

에러로그

mvn test 실행시 ..라기보단 메이븐 빌드 자체가 안되는데

[ERROR] Failed to execute goal org.apache.maven.plugins:maven-surefire-plugin:2.12.4:test (default-test) on project sb-tools-core: Execution default-test of goal org.apache.maven.plugins:maven-surefire-plugin:2.12.4:test failed: The forked VM terminated without saying properly goodbye. VM crash or System.exit called ? -> [Help 1]
[ERROR]
[ERROR] To see the full stack trace of the errors, re-run Maven with the -e switch.
[ERROR] Re-run Maven using the -X switch to enable full debug logging.
[ERROR]
[ERROR] For more information about the errors and possible solutions, please read the following articles:
[ERROR] [Help 1] http://cwiki.apache.org/confluence/display/MAVEN/PluginExecutionException
[ERROR]
[ERROR] After correcting the problems, you can resume the build with the command
[ERROR] mvn -rf :sb-tools-core

원인

모름

영문을 모르겠네.. 의존성 문제 아닌 것 같은게 노트북에서는 잘되니까

둘다 ubuntu 18.04, openjdk1.8, sdkman 이용 환경설치

노트북은 i5 8th. ram 8G sdd512 ubuntu 18.04 lenovo ideapad 320s

문제의 테스크탑은 amd ryzen 2700x? ram 32g 128ssd ubuntu 18.04

하드웨어 사양을 왜 썼냐면… 멀티코어 때문에 생기는 문제가 아닌가 싶어서

해결

못함